{"text_format":"1","workbook":"xlsx","n_sheets":9,"sheets":["Rif","0","1","1 (2)","1 (3)","2","2 (2)","3","3 (2)"],"not_rendered":{"charts":0,"images":58,"macros":1,"external_links":0,"defined_names":13,"comments":0,"pivot_tables":0},"unopened":[],"bounds":{"document_bytes":16777216,"sheet_cells":100000,"rows_first":2000,"rows_last":500,"rows_between":2000,"halvings":0,"cell_chars":16384,"cell_head_chars":4096},"cells_cut":0,"cells_raw":0,"read":"whole","date_system":"1900"}

{"sheet":"Rif","index":0,"n_rows":59,"n_cols":122,"rows_kept":59,"cut":false,"hidden":false,"merged":[[8,53,8,54],[4,27,4,28],[4,10,4,11],[4,12,4,13],[4,14,4,15],[4,16,4,17],[4,18,4,19],[4,20,4,21],[4,23,4,24],[4,25,4,26],[7,114,7,115],[7,116,7,117],[7,101,7,102],[7,103,7,104],[7,105,7,106],[7,107,7,108],[7,109,7,110],[7,112,7,113],[7,99,7,100],[8,68,8,69],[8,70,8,71],[8,55,8,56],[8,57,8,58],[8,59,8,60],[8,61,8,62],[8,63,8,64],[8,66,8,67]]}
[]
[]
[]
[]
[null,null,null,null,null,null,null,null,null,null,"f N/mm2",null,"t0 N/mm2",null,"fv0 N/mm2",null,"E N/mm2",null,"G N/mm2",null,"w KN/m3",null,null,"Malta buona",null,"ricorsi o listature ",null,"connessione trasversale"]
[null,null,null,"Mesistente",null,null,null,null,null,null,"min","max","min","max","min","max","min","max","min","max","min","max",null,true,false,true,false,true,false]
[null,null,null,"Muratura in pietrame disordinata ",null,null,null,null,null,null,1,2,1.7999999999999999E-2,3.2000000000000001E-2,"-","-",690,1050,230,350,19,19,"Muratura in pietrame disordinata ",1.5,1,1.3,1,1.5,1]
[null,null,null,"Muratura a conci sbozzati, con paramenti di spessore disomogeneo",null,null,null,null,null,null,2,2,3.5000000000000003E-2,5.0999999999999997E-2,"-","-",1020,1440,340,480,20,20,"Muratura a conci sbozzati, con paramenti di spessore disomogeneo",1.4,1,1.2,1,1.5,1,null,null,null,null,null,null,null,null,null,null,null,null,null,null,null,null,null,null,null,null,null,null,null,null,null,null,null,null,null,null,null,null,null,null,null,null,null,null,null,null,null,null,null,null,null,null,null,null,null,null,null,null,null,null,null,null,null,null,null,null,null,null,null,null,null,null,null,null,null,null,"f N/mm2",null,"t0 N/mm2",null,"fv0 N/mm2",null,"E N/mm2",null,"G N/mm2",null,"w KN/m3",null,null,"Malta buona",null,"ricorsi o listature ",null,"connessione trasversale"]
[null,null,null,"Muratura in pietre a spacco con buona tessitura",null,null,null,null,null,null,2.6,3.8,5.6000000000000001E-2,7.3999999999999996E-2,"-","-",1500,1980,500,660,21,21,"Muratura in pietre a spacco con buona tessitura",1.3,1,1.1000000000000001,1,1.3,1,null,null,null,null,null,null,null,null,null,null,null,null,null,null,null,null,null,null,null,null,null,null,null,null,"f N/mm2",null,"t0 N/mm2",null,"fv0 N/mm2",null,"E N/mm2",null,"G N/mm2",null,"w KN/m3",null,null,"Malta buona",null,"ricorsi o listature ",null,"connessione trasversale",null,null,null,null,null,null,null,null,null,null,null,null,null,null,null,null,null,null,null,null,null,"Mesistente",null,null,null,null,null,null,"min","max","min","max","min","max","min","max","min","max","min","max",null,true,false,true,false,true,false]
[null,null,null,"Muratura irregolare di pietra tenera ",null,null,null,null,null,null,1.4,2.2000000000000002,2.8000000000000001E-2,4.2000000000000003E-2,"-","-",900,1260,300,420,14.5,14.5,"Muratura irregolare di pietra tenera ",1.5,1,1.2,1,1.3,1,null,null,null,null,null,null,null,null,null,null,null,null,null,null,null,null,null,"Mesistente",null,null,null,null,null,null,"min","max","min","max","min","max","min","max","min","max","min","max",null,true,false,true,false,true,false,null,null,null,null,null,null,null,null,null,null,null,null,null,null,null,null,null,null,null,null,"Muratura in pietrame disordinata ",null,null,null,null,null,null,1,2,1.7999999999999999E-2,3.2000000000000001E-2,"-","-",690,1050,230,350,19,19,"Muratura in pietrame disordinata ",1.5,1,1.3,1,1.5,1]
[null,null,null,"Muratura a conci regolari di pietra tenera ",null,null,null,null,null,null,2,3.2,0.04,0.08,0.1,0.19,1200,1620,400,500,14.5,14.5,"Muratura a conci regolari di pietra tenera ",1.6,1,1,1,1.2,1,null,null,null,null,null,null,null,null,null,null,null,null,null,null,null,null,null,"Muratura in pietrame disordinata ",null,null,null,null,null,null,1,2,1.7999999999999999E-2,3.2000000000000001E-2,"-","-",690,1050,230,350,19,19,"Muratura in pietrame disordinata ",1.5,1,1.3,1,1.5,1,null,null,null,null,null,null,null,null,null,null,null,null,null,null,null,null,null,null,null,null,"Muratura a conci sbozzati, con paramenti di spessore disomogeneo",null,null,null,null,null,null,2,2,3.5000000000000003E-2,5.0999999999999997E-2,"-","-",1020,1440,340,480,20,20,"Muratura a conci sbozzati, con paramenti di spessore disomogeneo",1.4,1,1.2,1,1.5,1]
[null,null,null,"Muratura a blocchi lapidei squadrati",null,null,null,null,null,null,5.8,8.1999999999999993,0.09,0.12,0.18,0.28000000000000003,2400,3300,800,1100,22,22,"Muratura a blocchi lapidei squadrati",1.2,1,1,1,1.2,1,null,null,null,null,null,null,null,null,null,null,null,null,null,null,null,null,null,"Muratura a conci sbozzati, con paramenti di spessore disomogeneo",null,null,null,null,null,null,2,2,3.5000000000000003E-2,5.0999999999999997E-2,"-","-",1020,1440,340,480,20,20,"Muratura a conci sbozzati, con paramenti di spessore disomogeneo",1.4,1,1.2,1,1.5,1,null,null,null,null,null,null,null,null,null,null,null,null,null,null,null,null,null,null,null,null,"Muratura in pietre a spacco con buona tessitura",null,null,null,null,null,null,2.6,3.8,5.6000000000000001E-2,7.3999999999999996E-2,"-","-",1500,1980,500,660,21,21,"Muratura in pietre a spacco con buona tessitura",1.3,1,1.1000000000000001,1,1.3,1]
[null,null,null,"Muratura in mattoni pieni e malta di calce",null,null,null,null,null,null,2.6,4.3,0.05,0.13,0.13,0.27,1200,1800,400,600,18,18,"Muratura in mattoni pieni e malta di calce",{"$f":"K20^0.35","v":1},1,1,1,1.3,1,null,null,null,null,null,null,null,null,null,null,null,null,null,null,null,null,null,"Muratura in pietre a spacco con buona tessitura",null,null,null,null,null,null,2.6,3.8,5.6000000000000001E-2,7.3999999999999996E-2,"-","-",1500,1980,500,660,21,21,"Muratura in pietre a spacco con buona tessitura",1.3,1,1.1000000000000001,1,1.3,1,null,null,null,null,null,null,null,null,null,null,null,null,null,null,null,null,null,null,null,null,"Muratura irregolare di pietra tenera ",null,null,null,null,null,null,1.4,2.2000000000000002,2.8000000000000001E-2,4.2000000000000003E-2,"-","-",900,1260,300,420,14.5,14.5,"Muratura irregolare di pietra tenera ",1.5,1,1.2,1,1.3,1]
[null,null,null,"Muratura in mattoni semipieni con malta cementizia",null,null,null,null,null,null,5,8,0.08,0.17,0.2,0.36,3500,5600,875,1400,15,15,"Muratura in mattoni semipieni con malta cementizia",1.2,1,1,1,1,1,null,null,null,null,null,null,null,null,null,null,null,null,null,null,null,null,null,"Muratura irregolare di pietra tenera ",null,null,null,null,null,null,1.4,2.2000000000000002,2.8000000000000001E-2,4.2000000000000003E-2,"-","-",900,1260,300,420,14.5,14.5,"Muratura irregolare di pietra tenera ",1.5,1,1.2,1,1.3,1,null,null,null,null,null,null,null,null,null,null,null,null,null,null,null,null,null,null,null,null,"Muratura a conci regolari di pietra tenera ",null,null,null,null,null,null,2,3.2,0.04,0.08,0.1,0.19,1200,1620,400,500,14.5,14.5,"Muratura a conci regolari di pietra tenera ",1.6,1,1,1,1.2,1]
[null,null,null,"Muratura in pietrame disordinata ",null,null,null,null,null,null,{"$f":"VLOOKUP(Rif!$D$15,$D$7:$V$14,8,FALSE)","v":1},{"$f":"VLOOKUP(Rif!$D$15,$D$7:$V$14,9,FALSE)","v":2},{"$f":"VLOOKUP(Rif!$D$15,$D$7:$V$14,10,FALSE)","v":1.7999999999999999E-2},{"$f":"VLOOKUP(Rif!$D$15,$D$7:$V$14,11,FALSE)","v":3.2000000000000001E-2},{"$f":"VLOOKUP(Rif!$D$15,$D$7:$V$14,12,FALSE)","v":"-"},{"$f":"VLOOKUP(Rif!$D$15,$D$7:$V$14,13,FALSE)","v":"-"},{"$f":"VLOOKUP(Rif!$D$15,$D$7:$V$14,14,FALSE)","v":690},{"$f":"VLOOKUP(Rif!$D$15,$D$7:$V$14,15,FALSE)","v":1050},{"$f":"VLOOKUP(Rif!$D$15,$D$7:$V$14,16,FALSE)","v":230},{"$f":"VLOOKUP(Rif!$D$15,$D$7:$V$14,17,FALSE)","v":350},{"$f":"VLOOKUP(Rif!$D$15,$D$7:$V$14,18,FALSE)","v":19},{"$f":"VLOOKUP(Rif!$D$15,$D$7:$V$14,19,FALSE)","v":19},null,{"$f":"VLOOKUP(Rif!$D$15,$W$7:$AC$14,2,FALSE)","v":1.5},{"$f":"VLOOKUP(Rif!$D$15,$W$7:$AC$14,3,FALSE)","v":1},{"$f":"VLOOKUP(Rif!$D$15,$W$7:$AC$14,4,FALSE)","v":1.3},{"$f":"VLOOKUP(Rif!$D$15,$W$7:$AC$14,5,FALSE)","v":1},{"$f":"VLOOKUP(Rif!$D$15,$W$7:$AC$14,6,FALSE)","v":1.5},{"$f":"VLOOKUP(Rif!$D$15,$W$7:$AC$14,7,FALSE)","v":1},null,null,null,null,null,null,null,null,null,null,null,null,null,null,null,null,null,"Muratura a conci regolari di pietra tenera ",null,null,null,null,null,null,2,3.2,0.04,0.08,0.1,0.19,1200,1620,400,500,14.5,14.5,"Muratura a conci regolari di pietra tenera ",1.6,1,1,1,1.2,1,null,null,null,null,null,null,null,null,null,null,null,null,null,null,null,null,null,null,null,null,"Muratura a blocchi lapidei squadrati",null,null,null,null,null,null,5.8,8.1999999999999993,0.09,0.12,0.18,0.28000000000000003,2400,3300,800,1100,22,22,"Muratura a blocchi lapidei squadrati",1.2,1,1,1,1.2,1]
[null,null,null,null,null,null,null,null,null,null,null,null,null,null,null,null,null,null,null,null,null,null,null,null,null,null,null,null,null,null,null,null,null,null,null,null,null,null,null,null,null,null,null,null,null,null,"Muratura a blocchi lapidei squadrati",null,null,null,null,null,null,5.8,8.1999999999999993,0.09,0.12,0.18,0.28000000000000003,2400,3300,800,1100,22,22,"Muratura a blocchi lapidei squadrati",1.2,1,1,1,1.2,1,null,null,null,null,null,null,null,null,null,null,null,null,null,null,null,null,null,null,null,null,"Muratura in mattoni pieni e malta di calce",null,null,null,null,null,null,2.6,4.3,0.05,0.13,0.13,0.27,1200,1800,400,600,18,18,"Muratura in mattoni pieni e malta di calce",{"$f":"CV23^0.35","v":{"$error":"#N/A"}},1,1,1,1.3,1]
[null,null,null,null,null,1,{"$f":"VLOOKUP(F17,I17:J19,2)","v":"LC1"},null,1,"LC1",{"$f":"MIN(K15:L15)","v":1},null,{"$f":"MIN(M15:N15)","v":1.7999999999999999E-2},null,{"$f":"MIN(O15:P15)","v":0},null,{"$f":"AVERAGE(Q15:R15)","v":870},null,{"$f":"AVERAGE(S15:T15)","v":290},null,null,null,null,"Malta",null,"ricorsi",null,"conn",null,null,null,"Coeff migliorativi",null,null,null,null,null,null,null,null,null,null,null,null,null,null,"Muratura in mattoni pieni e malta di calce",null,null,null,null,null,null,2.6,4.3,0.05,0.13,0.13,0.27,1200,1800,400,600,18,18,"Muratura in mattoni pieni e malta di calce",{"$f":"BB24^0.35","v":{"$error":"#N/A"}},1,1,1,1.3,1,null,null,null,null,null,null,null,null,null,null,null,null,null,null,null,null,null,null,null,null,"Muratura in mattoni semipieni con malta cementizia",null,null,null,null,null,null,5,8,0.08,0.17,0.2,0.36,3500,5600,875,1400,15,15,"Muratura in mattoni semipieni con malta cementizia",1.2,1,1,1,1,1]
[null,null,null,null,null,null,null,null,2,"LC2",{"$f":"AVERAGE(K15:L15)","v":1.5},null,{"$f":"AVERAGE(M15:N15)","v":2.5000000000000001E-2},null,{"$f":"AVERAGE(O15:P15)","v":{"$error":"#DIV/0!"}},null,{"$f":"AVERAGE(Q15:R15)","v":870},null,{"$f":"AVERAGE(S15:T15)","v":290},null,null,null,true,{"$f":"X15","v":1.5},null,{"$f":"Z15","v":1.3},null,{"$f":"AB15","v":1.5},null,null,null,false,"malta buona",null,null,null,null,null,null,null,null,null,null,null,null,null,"Muratura in mattoni semipieni con malta cementizia",null,null,null,null,null,null,5,8,0.08,0.17,0.2,0.36,3500,5600,875,1400,15,15,"Muratura in mattoni semipieni con malta cementizia",1.2,1,1,1,1,1,null,null,null,null,null,null,null,null,null,null,null,null,null,null,null,null,null,null,null,null,null,null,null,null,null,null,null,{"$f":"VLOOKUP(#REF!,$CO$10:$DG$17,8,FALSE)","v":{"$error":"#REF!"}},{"$f":"VLOOKUP(#REF!,$CO$10:$DG$17,9,FALSE)","v":{"$error":"#REF!"}},{"$f":"VLOOKUP(#REF!,$CO$10:$DG$17,10,FALSE)","v":{"$error":"#REF!"}},{"$f":"VLOOKUP(#REF!,$CO$10:$DG$17,11,FALSE)","v":{"$error":"#REF!"}},{"$f":"VLOOKUP(#REF!,$CO$10:$DG$17,12,FALSE)","v":{"$error":"#REF!"}},{"$f":"VLOOKUP(#REF!,$CO$10:$DG$17,13,FALSE)","v":{"$error":"#REF!"}},{"$f":"VLOOKUP(#REF!,$CO$10:$DG$17,14,FALSE)","v":{"$error":"#REF!"}},{"$f":"VLOOKUP(#REF!,$CO$10:$DG$17,15,FALSE)","v":{"$error":"#REF!"}},{"$f":"VLOOKUP(#REF!,$CO$10:$DG$17,16,FALSE)","v":{"$error":"#REF!"}},{"$f":"VLOOKUP(#REF!,$CO$10:$DG$17,17,FALSE)","v":{"$error":"#REF!"}},{"$f":"VLOOKUP(#REF!,$CO$10:$DG$17,18,FALSE)","v":{"$error":"#REF!"}},{"$f":"VLOOKUP(#REF!,$CO$10:$DG$17,19,FALSE)","v":{"$error":"#REF!"}},null,{"$f":"VLOOKUP(#REF!,$DH$10:$DN$17,2,FALSE)","v":{"$error":"#REF!"}},{"$f":"VLOOKUP(#REF!,$DH$10:$DN$17,3,FALSE)","v":{"$error":"#REF!"}},{"$f":"VLOOKUP(#REF!,$DH$10:$DN$17,4,FALSE)","v":{"$error":"#REF!"}},{"$f":"VLOOKUP(#REF!,$DH$10:$DN$17,5,FALSE)","v":{"$error":"#REF!"}},{"$f":"VLOOKUP(#REF!,$DH$10:$DN$17,6,FALSE)","v":{"$error":"#REF!"}},{"$f":"VLOOKUP(#REF!,$DH$10:$DN$17,7,FALSE)","v":{"$error":"#REF!"}}]
[null,null,null,null,null,null,null,null,3,"LC3",{"$f":"VALUE(L19)","v":1},"1",{"$f":"VALUE(N19)","v":1.7999999999999999E-2},"0.018",null,null,{"$f":"VALUE(R19)","v":870},"870",{"$f":"VALUE(T19)","v":290},"290",null,null,false,{"$f":"Y15","v":1},null,{"$f":"AA15","v":1},null,{"$f":"AC15","v":1},null,null,null,false,"ricorsi o listature ",null,null,null,null,null,null,null,null,null,null,null,null,null,null,null,null,null,null,null,null,{"$f":"VLOOKUP(#REF!,$AU$11:$BM$18,8,FALSE)","v":{"$error":"#REF!"}},{"$f":"VLOOKUP(#REF!,$AU$11:$BM$18,9,FALSE)","v":{"$error":"#REF!"}},{"$f":"VLOOKUP(#REF!,$AU$11:$BM$18,10,FALSE)","v":{"$error":"#REF!"}},{"$f":"VLOOKUP(#REF!,$AU$11:$BM$18,11,FALSE)","v":{"$error":"#REF!"}},{"$f":"VLOOKUP(#REF!,$AU$11:$BM$18,12,FALSE)","v":{"$error":"#REF!"}},{"$f":"VLOOKUP(#REF!,$AU$11:$BM$18,13,FALSE)","v":{"$error":"#REF!"}},{"$f":"VLOOKUP(#REF!,$AU$11:$BM$18,14,FALSE)","v":{"$error":"#REF!"}},{"$f":"VLOOKUP(#REF!,$AU$11:$BM$18,15,FALSE)","v":{"$error":"#REF!"}},{"$f":"VLOOKUP(#REF!,$AU$11:$BM$18,16,FALSE)","v":{"$error":"#REF!"}},{"$f":"VLOOKUP(#REF!,$AU$11:$BM$18,17,FALSE)","v":{"$error":"#REF!"}},{"$f":"VLOOKUP(#REF!,$AU$11:$BM$18,18,FALSE)","v":{"$error":"#REF!"}},{"$f":"VLOOKUP(#REF!,$AU$11:$BM$18,19,FALSE)","v":{"$error":"#REF!"}},null,{"$f":"VLOOKUP(#REF!,$BN$11:$BT$18,2,FALSE)","v":{"$error":"#REF!"}},{"$f":"VLOOKUP(#REF!,$BN$11:$BT$18,3,FALSE)","v":{"$error":"#REF!"}},{"$f":"VLOOKUP(#REF!,$BN$11:$BT$18,4,FALSE)","v":{"$error":"#REF!"}},{"$f":"VLOOKUP(#REF!,$BN$11:$BT$18,5,FALSE)","v":{"$error":"#REF!"}},{"$f":"VLOOKUP(#REF!,$BN$11:$BT$18,6,FALSE)","v":{"$error":"#REF!"}},{"$f":"VLOOKUP(#REF!,$BN$11:$BT$18,7,FALSE)","v":{"$error":"#REF!"}}]
[null,null,null,null,null,null,null,null,null,null,{"$f":"VLOOKUP($G$17,$J$17:$T$19,2,FALSE)","v":1},null,{"$f":"VLOOKUP($G$17,$J$17:$T$19,4,FALSE)","v":1.7999999999999999E-2},null,{"$f":"VLOOKUP($G$17,$J$17:$T$19,6,FALSE)","v":0},null,{"$f":"VLOOKUP($G$17,$J$17:$T$19,8,FALSE)","v":870},null,{"$f":"VLOOKUP($G$17,$J$17:$T$19,10,FALSE)","v":290},null,null,null,null,{"$f":"VLOOKUP($AF$18,$W$18:$AC$19,2,FALSE)","v":1},null,{"$f":"VLOOKUP($AF$19,$W$18:$AC$19,4,FALSE)","v":1},null,{"$f":"VLOOKUP($AF$20,$W$18:$AC$19,6,FALSE)","v":1},null,null,null,false,"connessione trasversale",null,null,null,null,null,null,null,null,null,null,null,null,null,null,null,null,null,null,null,null,null,null,null,null,null,null,null,null,null,null,null,null,null,null,null,null,null,null,null,null,null,null,null,null,null,null,null,null,null,null,null,null,null,null,null,null,null,null,null,null,null,3,{"$f":"VLOOKUP(CQ20,CT20:CU22,2)","v":"LC3"},null,1,"LC1",{"$f":"MIN(CV18:CW18)","v":{"$error":"#REF!"}},null,{"$f":"MIN(CX18:CY18)","v":{"$error":"#REF!"}},null,{"$f":"MIN(CZ18:DA18)","v":{"$error":"#REF!"}},null,{"$f":"AVERAGE(DB18:DC18)","v":{"$error":"#REF!"}},null,{"$f":"AVERAGE(DD18:DE18)","v":{"$error":"#REF!"}},null,null,null,null,"Malta",null,"ricorsi",null,"conn",null,null,null,"Coeff migliorativi"]
{"$rows_left_out":40}
{"sheet":"0","index":1,"n_rows":27,"n_cols":12,"rows_kept":27,"cut":false,"hidden":false,"merged":[[1,1,2,11],[3,1,8,11],[9,1,17,11],[18,1,19,11]]}
[]
[null,"CRM - SISTEMA CONSOLIDA E RINFORZA"]
[]
[null,"La soluzione tecnica proposta e i dati riportati vengono forniti esclusivamente a titolo di servizio Tecnico-Commerciale nell’ambito dell’attività di vendita esercitata da Ferri SRL.; i medesimi dati non costituiscono in alcun modo specifica tecnica e sono puramente indicativi in quanto risultanti dalla elaborazione dei dati base di “input” (a titolo esemplificativo: tipologia di muratura, spessore della muratura, livello di conoscenza, parametri migliorativi, etc.) forniti dal Cliente. Ferri SRL è azienda unicamente fornitrice dei materiali per uso professionale e non può ad alcun titolo ritenersi responsabile della correttezza e adeguatezza del dimensionamento della sezione composta e della relazione tecnica allo specifico intervento nel quale il Cliente intende utilizzare gli elementi di consolidamento. Sono di esclusiva competenza e responsabilità del Cliente la valutazione e la verifica di adeguatezza, congruità, adattabilità e utilizzabilità del presente documento tecnico all’impiego previsto; il Cliente solleva ed esonera pertanto Ferri SRL da ogni responsabilità al riguardo. La presente relazione tecnica non può in alcun modo essere utilizzata per il deposito presso gli Uffici Tecnici competenti. \n\nLa verifica di correttezza e adeguatezza della relazione tecnica allo specifico intervento nel quale il Cliente intende utilizzare gli elementi di consolidamento deve sempre essere valutata e certificata da un professionista tecnico abilitato ai sensi di legge.\n"]
[]
[]
[]
[]
[]
[]
[]
[]
[]
[]
[]
[]
[]
[]
[]
[]
{"$rows_left_out":8}
{"sheet":"1","index":2,"n_rows":23,"n_cols":12,"rows_kept":23,"cut":false,"hidden":false,"merged":[[2,6,3,11],[8,2,8,5],[10,2,10,5],[13,3,13,5],[22,2,22,8],[14,4,16,5],[13,8,13,10],[18,2,18,11],[19,2,19,8],[20,2,20,8],[21,2,21,8]]}
[]
[]
[null,null,null,null,null,null,"DEFINIZIONE MURATURA ESISTENTE"]
[]
[]
[]
[]
[]
[null,null,"Tipologia di muratura secondo NTC"]
[]
[null,null,"Spessore del paramento"]
[]
[]
[null,null,null,"Livello di conoscenza",null,null,null,null,"Parametri migliorativi"]
[null,null,null,null,"Sceglere il livello di conoscenza raggiunto per la muratura oggetto d'intervento"]
[]
[]
[]
[null,null,"Caratteristiche meccaniche muratura esistente"]
[null,null,"Resistenza media a compressione",null,null,null,null,null,null,"f",{"$f":"Rif!K21","v":1},"N/mm2"]
{"$rows_left_out":4}
{"sheet":"1 (2)","index":3,"n_rows":23,"n_cols":10,"rows_kept":23,"cut":false,"hidden":false,"merged":[[22,2,22,8],[14,4,16,5],[2,6,3,11],[8,2,8,5],[10,2,10,5],[13,3,13,5],[13,8,13,10],[14,8,16,10],[18,2,18,11],[19,2,19,8],[20,2,20,8],[21,2,21,8]]}
[]
[]
[null,null,null,null,null,null,"DEFINIZIONE MURATURA ESISTENTE"]
[]
[]
[]
[]
[]
[null,null,"Tipologia di muratura secondo NTC"]
[]
[null,null,"Spessore del paramento"]
[]
[]
[null,null,null,"Livello di conoscenza",null,null,null,null,"Parametri migliorativi"]
[null,null,null,null,"Sceglere il livello di conoscenza raggiunto per la muratura oggetto d'intervento",null,null,null,"In LC3 i parametri migliorativi vengono quantificati nella fase di definizione delle caratteristiche meccaniche."]
[]
[]
[]
[null,null,"Caratteristiche meccaniche muratura esistente"]
[null,null,"Resistenza media a compressione",null,null,null,null,null,null,"f"]
{"$rows_left_out":4}
{"sheet":"1 (3)","index":4,"n_rows":23,"n_cols":10,"rows_kept":23,"cut":false,"hidden":false,"merged":[[22,2,22,8],[2,6,3,11],[10,2,10,5],[13,3,13,5],[13,8,13,10],[14,8,16,10],[8,2,8,5],[14,3,16,5],[18,2,18,11],[19,2,19,8],[20,2,20,8],[21,2,21,8]]}
[]
[]
[null,null,null,null,null,null,"DEFINIZIONE MURATURA ESISTENTE"]
[]
[]
[]
[]
[]
[null,null,"Tipologia più prossima secondo NTC"]
[]
[null,null,"Spessore del paramento"]
[]
[]
[null,null,null,"Livello di conoscenza",null,null,null,null,"Parametri migliorativi"]
[null,null,null,"Il livello di conoscenza non è applicabile alla muratura definita dall'utente.",null,null,null,null,"I parametri migliorativi non sono applicabili alla muratura definita da utente"]
[]
[]
[]
[null,null,"Caratteristiche meccaniche muratura esistente"]
[null,null,"Resistenza media a compressione",null,null,null,null,null,null,"f"]
{"$rows_left_out":4}
{"sheet":"2","index":5,"n_rows":32,"n_cols":12,"rows_kept":32,"cut":false,"hidden":false,"merged":[[31,2,31,8],[26,2,26,3],[26,9,26,10],[28,2,28,11],[29,2,29,8],[30,2,30,8],[19,2,19,8],[20,2,20,8],[23,2,23,11],[14,8,14,9],[16,2,16,11],[17,2,17,8],[18,2,18,8],[6,2,6,4],[6,6,6,8],[11,2,11,11],[14,2,14,3],[2,6,3,11]]}
[]
[]
[null,null,null,null,null,null,"DEFINIZIONE DEL RINFORZO"]
[]
[]
[]
[null,null,"Tipologia d'intervento",null,null,null,"Paramento a sacco"]
[]
[]
[]
[]
[null,null,"CARATTERISTICHE DELL'INTONACO"]
[]
[]
[null,null,"Tipologia intonaco",null,null,null,null,null,"Spessore intonaco"]
[]
[null,null,"Parametri meccanici intonaco"]
[null,null,"Resistenza a trazione",null,null,null,null,null,null,"ft,int ",{"$f":"Rif!$AI$35","v":3.5714285714285716},"N/mm2"]
[null,null,"Modulo elastico",null,null,null,null,null,null,"Eint",{"$f":"Rif!$AE$35","v":9000},"N/mm2"]
[null,null,"Rapporto f/E",null,null,null,null,null,null,"εint",{"$f":"$K$18/$K$19","v":3.9682539682539683E-4}]
{"$rows_left_out":13}
{"sheet":"2 (2)","index":6,"n_rows":32,"n_cols":12,"rows_kept":32,"cut":false,"hidden":false,"merged":[[31,2,31,8],[16,2,16,11],[17,2,17,8],[18,2,18,8],[19,2,19,8],[20,2,20,8],[23,2,23,11],[26,2,26,3],[26,9,26,10],[28,2,28,11],[29,2,29,8],[30,2,30,8],[2,6,3,11],[6,2,6,4],[6,6,6,8],[11,2,11,11],[14,2,14,3],[14,8,14,9]]}
[]
[]
[null,null,null,null,null,null,"DEFINIZIONE DEL RINFORZO"]
[]
[]
[]
[null,null,"Tipologia d'intervento",null,null,null,"Paramento a sacco"]
[]
[]
[]
[]
[null,null,"CARATTERISTICHE DELL'INTONACO"]
[]
[]
[null,null,"Tipologia intonaco",null,null,null,null,null,"Spessore intonaco"]
[]
[null,null,"Parametri meccanici intonaco"]
[null,null,"Resistenza a trazione",null,null,null,null,null,null,"ft,int ",{"$f":"Rif!$AI$35","v":3.5714285714285716},"N/mm2"]
[null,null,"Modulo elastico",null,null,null,null,null,null,"Eint",{"$f":"Rif!$AE$35","v":9000},"N/mm2"]
[null,null,"Rapporto f/E",null,null,null,null,null,null,"εint",{"$f":"$K$18/$K$19","v":3.9682539682539683E-4}]
{"$rows_left_out":13}
{"sheet":"3","index":7,"n_rows":41,"n_cols":12,"rows_kept":41,"cut":false,"hidden":false,"merged":[[2,6,3,11],[16,8,16,9],[10,2,10,4],[12,2,12,3],[10,5,10,11],[14,4,14,5],[16,4,16,5],[16,10,16,11],[12,7,12,9],[12,10,12,11],[23,2,23,8],[26,2,26,8],[29,2,29,8],[32,2,32,8],[35,2,35,11],[22,2,22,11],[19,2,19,11],[7,2,7,11],[14,2,14,3],[14,8,14,9],[16,2,16,3],[40,2,40,11],[24,2,24,4],[24,6,24,8],[27,2,27,4],[27,6,27,8],[30,2,30,4],[33,2,33,4],[38,2,38,8],[38,10,38,11],[37,2,37,8],[36,10,36,11],[37,10,37,11],[36,2,36,8]]}
[]
[]
[null,null,null,null,null,null,"MURATURA RINFORZATA"]
[]
[]
[]
[]
[null,null,"RIEPILOGO PARAMETRI IMMESSI"]
[]
[]
[null,null,"Tipologia di muratura",null,null,{"$f":"Rif!$D$15","v":"Muratura in pietrame disordinata "}]
[]
[null,null,"Spessore muratura",null,{"$f":"Rif!$F$23","v":"300"},"mm",null,"Livello di conoscenza",null,null,{"$f":"Rif!$G$17","v":"LC1"}]
[]
[null,null,"Tipologia intonaco",null,{"$f":"Rif!$Z$35","v":"FM55"},null,null,null,"Spessore intonaco",null,{"$f":"Rif!$Q$36","v":"30"},"mm"]
[]
[null,null,"Tipologia rete",null,{"$f":"Rif!$Z$29","v":"RG NET BA G33"},null,null,null,"Connettori al m2",null,{"$f":"Rif!$N$41","v":"6"}]
[]
[]
[null,null,"CARATTERISTICHE MECCANICHE MURATURA RINFORZATA"]
{"$rows_left_out":22}
{"sheet":"3 (2)","index":8,"n_rows":41,"n_cols":12,"rows_kept":41,"cut":false,"hidden":false,"merged":[[16,10,16,11],[19,2,19,11],[22,2,22,11],[23,2,23,8],[26,2,26,8],[14,2,14,3],[14,4,14,5],[14,8,14,9],[16,2,16,3],[16,4,16,5],[16,8,16,9],[2,6,3,11],[7,2,7,11],[10,2,10,4],[10,5,10,11],[12,2,12,3],[40,2,40,11],[24,2,24,4],[24,6,24,8],[27,2,27,4],[27,6,27,8],[30,2,30,4],[33,2,33,4],[38,2,38,8],[38,10,38,11],[29,2,29,8],[32,2,32,8],[35,2,35,11],[36,2,36,8],[36,10,36,11],[37,2,37,8],[37,10,37,11]]}
[]
[]
[null,null,null,null,null,null,"MURATURA RINFORZATA"]
[]
[]
[]
[]
[null,null,"RIEPILOGO PARAMETRI IMMESSI"]
[]
[]
[null,null,"Tipologia di muratura da NTC",null,null,{"$f":"Rif!$D$15","v":"Muratura in pietrame disordinata "}]
[]
[null,null,"Spessore muratura",null,{"$f":"Rif!$F$23","v":"300"},"mm"]
[]
[null,null,"Tipologia intonaco",null,{"$f":"Rif!$Z$35","v":"FM55"},null,null,null,"Spessore intonaco",null,{"$f":"Rif!$Q$36","v":"30"},"mm"]
[]
[null,null,"Tipologia rete",null,{"$f":"Rif!$Z$29","v":"RG NET BA G33"},null,null,null,"Connettori al m2",null,{"$f":"Rif!$N$41","v":"6"}]
[]
[]
[null,null,"CARATTERISTICHE MECCANICHE MURATURA RINFORZATA"]
{"$rows_left_out":21}